setup
checks.x86_64-linux.gatewayToplevel
· build #4
· raw
1these 30 derivations will be built:2 /nix/store/76rnk9zzdjpbnfnzvnkx7g04dhddvbjd-libnetfilter_conntrack-aarch64-unknown-linux-gnu-1.1.1.drv3 /nix/store/yzmgfsmq63msfzspagghz966vyy9w394-cmm-aarch64-unknown-linux-gnu-17.03.1.drv4 /nix/store/sh9a7n4jyill95fz36c9wjpa6xxriqv0-system-path.drv5 /nix/store/pkkfnamsmzi9dp1v4myc7ca4nj2hj000-dbus-1.drv6 /nix/store/cc0cl0v27bcayp55qfq1aldysdypmj1z-X-Restart-Triggers-dbus-broker.drv7 /nix/store/1my4b1i6q9d1gj3d7c2n6a2ykim1rwhb-unit-dbus-broker.service.drv8 /nix/store/sxx52ip8aqmwm1my27cmsv0005cnbcgy-aarch64-unknown-linux-gnu-rustc-1.95.0.drv9 /nix/store/xyk9adbnqgxp8y3hpc6a1ji6778xccz9-aarch64-unknown-linux-gnu-rustc-wrapper-1.95.0.drv10 /nix/store/yim3z58drs8zfkm576wq875gjlk84bwg-aarch64-unknown-linux-gnu-cargo-1.95.0.drv11 /nix/store/3magyhd4h6l8pmb88jk3lpik215i60i6-auditable-aarch64-unknown-linux-gnu-cargo-1.95.0.drv12 /nix/store/3kny8cgbvj5xxscipv95lhvdr3cyylwx-nixos-init-aarch64-unknown-linux-gnu-0.1.0.drv13 /nix/store/58cbp69z1ills6y517wm7nrgnvvn019l-unit-cmm.service.drv14 /nix/store/iqyb7i0rwhwjmg23g5nrq3cq0fs0ixr2-nsncd-1.5.2-vendor.drv15 /nix/store/74xc9cjbjpykaw3i0lk5sfvdw3amjrg9-nsncd-aarch64-unknown-linux-gnu-1.5.2.drv16 /nix/store/hxdqmp3xaj0mk0h5nnnnc3256rljsbyp-unit-nscd.service.drv17 /nix/store/hmbz2csm107qkky2d9s6h3f1baiyfd1y-make-initrd-ng-aarch64-unknown-linux-gnu-0.1.0.drv18 /nix/store/lhm79bsfmk2lrhvs1mfrkisiwrigkmg4-unit-generate-shutdown-ramfs.service.drv19 /nix/store/ngas84d5xbc13ippf9mp6k6d5dzddfa8-unit-dbus-broker.service.drv20 /nix/store/djczc0ch4pl13kks36ma7whyd5dpzzf4-system-units.drv21 /nix/store/n25494kyf84r79dsnrnynfb7b0rhzg23-user-units.drv22 /nix/store/2w2iawyi4gn7c9sdlfd3qzdj5wspixpc-etc.drv23 /nix/store/g6fg7f3l8axrb80zqa9yh811hynmbqdn-unit-script-initrd-find-nixos-closure-start.drv24 /nix/store/rxayf706ya3xp0iyhrizmrc2spqm5df9-linux-aarch64-unknown-linux-gnu-6.12.49-modules-shrunk.drv25 /nix/store/6sbmc1xgmlvcfk3c2c6jspszl7n8r3qf-unit-initrd-find-nixos-closure.service.drv26 /nix/store/wm702hv28lpqzhyqdn10vm6mlvd7fv2c-initrd-units.drv27 /nix/store/550571bkfz3vxl6gwivbjnpb6cwkdqdn-initrd-linux-aarch64-unknown-linux-gnu-6.12.49.drv28 /nix/store/bhs6m46c1wfhf8x36i2vagcfa67sk81b-switch-to-configuration-aarch64-unknown-linux-gnu-0.1.0.drv29 /nix/store/bvwilngqgi4rw53a8zvhw3891lh5qy1w-boot.json.drv30 /nix/store/cnazplgyadwcnz3azk1bmv2mlaa0wh57-activate.drv31 /nix/store/y87696hg7287y2gpd43c0yy39v40wn0i-nixos-system-gateway-26.05.20260907.93108a5.drv32error: Cannot build '/nix/store/76rnk9zzdjpbnfnzvnkx7g04dhddvbjd-libnetfilter_conntrack-aarch64-unknown-linux-gnu-1.1.1.drv'.33 Reason: builder failed with exit code 1.34 Output paths:35 /nix/store/r657kxcqwh0vz4ikfmarwzar9spjlaqd-libnetfilter_conntrack-aarch64-unknown-linux-gnu-1.1.136 Last 25 log lines:37 > patching file include/internal/object.h38 > patching file include/libnetfilter_conntrack/libnetfilter_conntrack.h39 > Hunk #1 FAILED at 144.40 > Hunk #2 succeeded at 220 (offset 1 line).41 > 1 out of 2 hunks FAILED -- saving rejects to file include/libnetfilter_conntrack/libnetfilter_conntrack.h.rej42 > patching file include/libnetfilter_conntrack/linux_nf_conntrack_common.h43 > patching file include/libnetfilter_conntrack/linux_nfnetlink_conntrack.h44 > Hunk #1 FAILED at 60.45 > Hunk #2 succeeded at 239 (offset 1 line).46 > 1 out of 2 hunks FAILED -- saving rejects to file include/libnetfilter_conntrack/linux_nfnetlink_conntrack.h.rej47 > patching file src/conntrack/api.c48 > patching file src/conntrack/build_mnl.c49 > patching file src/conntrack/compare.c50 > patching file src/conntrack/copy.c51 > patching file src/conntrack/getter.c52 > Hunk #1 succeeded at 389 with fuzz 1 (offset 5 lines).53 > Hunk #2 FAILED at 526.54 > 1 out of 2 hunks FAILED -- saving rejects to file src/conntrack/getter.c.rej55 > patching file src/conntrack/parse_mnl.c56 > Hunk #2 succeeded at 1024 with fuzz 2 (offset 4 lines).57 > Hunk #3 succeeded at 1172 with fuzz 1 (offset 10 lines).58 > patching file src/conntrack/setter.c59 > patching file src/conntrack/snprintf_default.c60 > patching file src/conntrack/snprintf_xml.c61 > patching file src/main.c62 For full logs, run:63 nix log /nix/store/76rnk9zzdjpbnfnzvnkx7g04dhddvbjd-libnetfilter_conntrack-aarch64-unknown-linux-gnu-1.1.1.drv64error: Cannot build '/nix/store/rxayf706ya3xp0iyhrizmrc2spqm5df9-linux-aarch64-unknown-linux-gnu-6.12.49-modules-shrunk.drv'.65 Reason: builder failed with exit code 1.66 Output paths:67 /nix/store/ixvq4ky26pkmw8jdzffhp81sgvv1xjm0-linux-aarch64-unknown-linux-gnu-6.12.49-modules-shrunk68 Last 11 log lines:69 > kernel version is 6.12.4970 > root module: autofs71 > builtin dependency: autofs472 > root module: efivarfs73 > copying dependency: /nix/store/55f5k6r7ccg69z2q1rj80d92w6aaarbc-linux-aarch64-unknown-linux-gnu-6.12.49-modules/lib/modules/6.12.49/kernel/fs/efivarfs/efivarfs.ko74 > root module: ext275 > builtin dependency: ext476 > root module: ext477 > builtin dependency: ext478 > root module: tpm-crb79 > modprobe: FATAL: Module tpm-crb not found in directory /nix/store/55f5k6r7ccg69z2q1rj80d92w6aaarbc-linux-aarch64-unknown-linux-gnu-6.12.49-modules/lib/modules/6.12.4980 For full logs, run:81 nix log /nix/store/rxayf706ya3xp0iyhrizmrc2spqm5df9-linux-aarch64-unknown-linux-gnu-6.12.49-modules-shrunk.drv82error: Cannot build '/nix/store/yzmgfsmq63msfzspagghz966vyy9w394-cmm-aarch64-unknown-linux-gnu-17.03.1.drv'.83 Reason: 1 dependency failed.84 Output paths:85 /nix/store/1q6jxrpgnwylpnjgxbzy3naw0c94lsgg-cmm-aarch64-unknown-linux-gnu-17.03.186error: Cannot build '/nix/store/sh9a7n4jyill95fz36c9wjpa6xxriqv0-system-path.drv'.87 Reason: 1 dependency failed.88 Output paths:89 /nix/store/k22yxf6kh1r4ayrbddp0xl5m9hgzzpif-system-path90error: Cannot build '/nix/store/58cbp69z1ills6y517wm7nrgnvvn019l-unit-cmm.service.drv'.91 Reason: 1 dependency failed.92 Output paths:93 /nix/store/iai04slkqm35rvq0xdigfpq7fbkwmbp0-unit-cmm.service94error: Cannot build '/nix/store/pkkfnamsmzi9dp1v4myc7ca4nj2hj000-dbus-1.drv'.95 Reason: 1 dependency failed.96 Output paths:97 /nix/store/cqyijrpi00613lyaac2ypb3xws67fmy4-dbus-198error: Cannot build '/nix/store/cc0cl0v27bcayp55qfq1aldysdypmj1z-X-Restart-Triggers-dbus-broker.drv'.99 Reason: 1 dependency failed.100 Output paths:101 /nix/store/4d1pc7sjmv2yvgsspz86q8kx4mcl3v5a-X-Restart-Triggers-dbus-broker102error: Cannot build '/nix/store/1my4b1i6q9d1gj3d7c2n6a2ykim1rwhb-unit-dbus-broker.service.drv'.103 Reason: 1 dependency failed.104 Output paths:105 /nix/store/5gs6lvm7gyhvrjmmd0nvk291i48bhad0-unit-dbus-broker.service106error: Cannot build '/nix/store/ngas84d5xbc13ippf9mp6k6d5dzddfa8-unit-dbus-broker.service.drv'.107 Reason: 1 dependency failed.108 Output paths:109 /nix/store/gda556j998mdkqjq9ijxjvnyjk48ps1g-unit-dbus-broker.service110error: Cannot build '/nix/store/n25494kyf84r79dsnrnynfb7b0rhzg23-user-units.drv'.111 Reason: 1 dependency failed.112 Output paths:113 /nix/store/2f7zf20d59if28kfzckfrm73j4akq0l2-user-units114error: Cannot build '/nix/store/djczc0ch4pl13kks36ma7whyd5dpzzf4-system-units.drv'.115 Reason: 2 dependencies failed.116 Output paths:117 /nix/store/85py6nqx7600kwhc8yx7l8yiyyanlj78-system-units118error: Cannot build '/nix/store/2w2iawyi4gn7c9sdlfd3qzdj5wspixpc-etc.drv'.119 Reason: 4 dependencies failed.120 Output paths:121 /nix/store/7yh1m79a6sdaifz20c6mmhidsbh8bapl-etc122error: Cannot build '/nix/store/cnazplgyadwcnz3azk1bmv2mlaa0wh57-activate.drv'.123 Reason: 1 dependency failed.124 Output paths:125 /nix/store/kgfdq5jcriw5il5ivdyvvrd54x43705h-activate126error: Cannot build '/nix/store/550571bkfz3vxl6gwivbjnpb6cwkdqdn-initrd-linux-aarch64-unknown-linux-gnu-6.12.49.drv'.127 Reason: 1 dependency failed.128 Output paths:129 /nix/store/r4hjkcr78hab0vp46l8b58q5jln38fd3-initrd-linux-aarch64-unknown-linux-gnu-6.12.49130error: Cannot build '/nix/store/bvwilngqgi4rw53a8zvhw3891lh5qy1w-boot.json.drv'.131 Reason: 1 dependency failed.132 Output paths:133 /nix/store/i1lgl5yxqx7nzljhw71a53izcalgzbz9-boot.json134error: Cannot build '/nix/store/y87696hg7287y2gpd43c0yy39v40wn0i-nixos-system-gateway-26.05.20260907.93108a5.drv'.135 Reason: 5 dependencies failed.136 Output paths:137 /nix/store/jv3k98dvm4hqx2ivmx4wchk77n3rc0b6-nixos-system-gateway-26.05.20260907.93108a5