nixbot

builds

failed citiesapp-frontend checks.x86_64-linux.package · build #59 · raw

unpackPhase
1unpacking source archive /nix/store/shs2x67vqhl63nc0gpywyd59wdifzdvp-y2i7aw2vy1767wb9nnw9jm3rkzsy8l41-source2source root is y2i7aw2vy1767wb9nnw9jm3rkzsy8l41-source3Executing cargoSetupPostUnpackHook4Finished cargoSetupPostUnpackHook
patchPhase
5Executing cargoSetupPostPatchHook6Validating consistency between /build/y2i7aw2vy1767wb9nnw9jm3rkzsy8l41-source/Cargo.lock and /build/cargo-vendor-dir/Cargo.lock7Finished cargoSetupPostPatchHook
buildPhase
8Executing cargoBuildHook9cargoBuildHook flags: -j 16 --target x86_64-unknown-linux-gnu --offline --profile release10 Compiling proc-macro2 v1.0.10711 Compiling quote v1.0.4712 Compiling unicode-ident v1.0.2413 Compiling libc v0.2.18914 Compiling cfg-if v1.0.415 Compiling pin-project-lite v0.2.1716 Compiling serde_core v1.0.22917 Compiling smallvec v1.15.218 Compiling memchr v2.8.319 Compiling serde v1.0.22920 Compiling bytes v1.12.121 Compiling futures-core v0.3.3422 Compiling itoa v1.0.1823 Compiling stable_deref_trait v1.2.124 Compiling parking_lot_core v0.9.1225 Compiling once_cell v1.21.426 Compiling shlex v2.0.127 Compiling futures-sink v0.3.3428 Compiling scopeguard v1.2.029 Compiling find-msvc-tools v0.1.1130 Compiling lock_api v0.4.1431 Compiling futures-channel v0.3.3432 Compiling log v0.4.3433 Compiling fs_extra v1.3.034 Compiling pkg-config v0.3.3435 Compiling dunce v1.0.536 Compiling futures-io v0.3.3437 Compiling slab v0.4.1238 Compiling futures-task v0.3.3439 Compiling tracing-core v0.1.3640 Compiling litemap v0.8.341 Compiling writeable v0.6.442 Compiling zeroize v1.9.043 Compiling percent-encoding v2.3.244 Compiling icu_properties_data v2.3.045 Compiling icu_normalizer_data v2.3.046 Compiling utf8_iter v1.0.447 Compiling aws-lc-rs v1.18.048 Compiling rustls-pki-types v1.15.149 Compiling tower-service v0.3.350 Compiling autocfg v1.5.151 Compiling httparse v1.10.152 Compiling form_urlencoded v1.2.253 Compiling strsim v0.11.154 Compiling ident_case v1.0.155 Compiling try-lock v0.2.556 Compiling httpdate v1.0.357 Compiling http v1.5.058 Compiling rustls v0.23.4359 Compiling fnv v1.0.760 Compiling untrusted v0.9.061 Compiling want v0.3.162 Compiling sync_wrapper v1.0.263 Compiling crossbeam-utils v0.8.2264 Compiling atomic-waker v1.1.265 Compiling num-traits v0.2.1966 Compiling zmij v1.0.2367 Compiling tower-layer v0.3.368 Compiling syn v3.0.469 Compiling syn v2.0.11970 Compiling subtle v2.6.171 Compiling thiserror v2.0.2072 Compiling getrandom v0.4.373 Compiling parking v2.2.174 Compiling serde_json v1.0.15175 Compiling iana-time-zone v0.1.6576 Compiling base64 v0.22.177 Compiling ipnet v2.12.178 Compiling event-listener v5.4.279 Compiling jobserver v0.1.3580 Compiling errno v0.3.1481 Compiling mio v1.2.282 Compiling socket2 v0.6.583 Compiling signal-hook-registry v1.4.884 Compiling cc v1.4.485 Compiling parking_lot v0.12.586 Compiling http-body v1.1.087 Compiling crossbeam-epoch v0.9.2088 Compiling portable-atomic v1.15.089 Compiling http-body-util v0.1.590 Compiling openssl-probe v0.2.191 Compiling rustls-native-certs v0.8.492 Compiling uuid v1.26.093 Compiling event-listener-strategy v0.5.494 Compiling deranged v0.5.895 Compiling anyhow v1.0.10496 Compiling siphasher v1.0.397 Compiling powerfmt v0.2.098 Compiling num-conv v0.2.299 Compiling redb v4.2.0100 Compiling time-core v0.1.9101 Compiling bitflags v2.13.1102 Compiling phf_shared v0.12.1103 Compiling async-lock v3.4.2104 Compiling crossbeam-channel v0.5.16105 Compiling cmake v0.1.58106 Compiling nom v8.0.0107 Compiling encoding_rs v0.8.35108 Compiling tagptr v0.2.0109 Compiling equivalent v1.0.2110 Compiling chrono-tz v0.10.4111 Compiling phf v0.12.1112 Compiling lazy_static v1.5.0113 Compiling mime v0.3.17114 Compiling ryu v1.0.23115 Compiling sharded-slab v0.1.7116 Compiling tracing-log v0.2.0117 Compiling serde_path_to_error v0.1.20118 Compiling thread_local v1.1.10119 Compiling nu-ansi-term v0.50.3120 Compiling aws-lc-sys v0.44.0121 Compiling time v0.3.55122 Compiling matchit v0.8.4123 Compiling either v1.18.0124 Compiling tracing-subscriber v0.3.23125 Compiling itertools v0.15.0126 Compiling quick-xml v0.41.0127 Compiling synstructure v0.13.2128 Compiling darling_core v0.20.11129 Compiling serde_derive v1.0.229130 Compiling zerovec-derive v0.11.6131 Compiling displaydoc v0.2.7132 Compiling futures-macro v0.3.34133 Compiling tokio-macros v2.7.2134 Compiling thiserror-impl v2.0.20135 Compiling async-trait v0.1.92136 Compiling zerofrom-derive v0.1.7137 Compiling yoke-derive v0.8.2138 Compiling tracing-attributes v0.1.31139 Compiling tokio v1.53.1140 Compiling futures-util v0.3.34141 Compiling nom-language v0.1.0142 Compiling iso8601 v0.6.5143 Compiling cobs v0.3.0144 Compiling zerofrom v0.1.8145 Compiling yoke v0.8.3146 Compiling tracing v0.1.44147 Compiling darling_macro v0.20.11148 Compiling zerovec v0.11.8149 Compiling zerotrie v0.2.5150 Compiling axum-core v0.5.6151 Compiling darling v0.20.11152 Compiling derive_builder_core v0.20.2153 Compiling tinystr v0.8.4154 Compiling potential_utf v0.1.6155 Compiling icu_locale_core v2.3.0156 Compiling icu_collections v2.3.0157 Compiling chrono v0.4.45158 Compiling http-serde v2.1.1159 Compiling postcard v1.1.3160 Compiling serde_urlencoded v0.7.1161 Compiling derive_builder_macro v0.20.2162 Compiling http-cache-semantics v3.0.0163 Compiling derive_builder v0.20.2164 Compiling icu_provider v2.3.1165 Compiling moka v0.12.16166 Compiling icu_properties v2.3.0167 Compiling icu_normalizer v2.3.0168 Compiling diligent-date-parser v0.1.5169 Compiling atom_syndication v0.12.10170 Compiling futures-executor v0.3.34171 Compiling futures v0.3.34172 Compiling rss v2.1.0173 Compiling idna_adapter v1.2.2174 Compiling idna v1.1.0175 Compiling hyper v1.11.0176 Compiling tower v0.5.3177 Compiling url v2.5.8178 Compiling tokio-util v0.7.19179 Compiling tower-http v0.6.11180 Compiling http-cache v1.0.0-alpha.8181 Compiling hyper-util v0.1.20182 Compiling axum v0.8.9183 Compiling icalendar v0.17.13184 Compiling rustls-webpki v0.103.15185 Compiling tokio-rustls v0.26.4186 Compiling rustls-platform-verifier v0.7.0187 Compiling hyper-rustls v0.27.9188 Compiling reqwest v0.13.4189 Compiling reqwest-middleware v0.5.2190 Compiling http-cache-reqwest v1.0.0-alpha.8191error[E0407]: method `policy` is not a member of trait `Middleware`192 --> /build/cargo-vendor-dir/http-cache-reqwest-1.0.0-alpha.8/src/lib.rs:464:5193 |194464 | / fn policy(&self, response: &HttpResponse) -> Result<CachePolicy> {195465 | | Ok(CachePolicy::new(&self.parts()?, &response.parts()?))196466 | | }197 | |_____^ not a member of trait `Middleware`198199error[E0407]: method `policy_with_options` is not a member of trait `Middleware`200 --> /build/cargo-vendor-dir/http-cache-reqwest-1.0.0-alpha.8/src/lib.rs:467:5201 |202467 | / fn policy_with_options(203468 | | &self,204469 | | response: &HttpResponse,205470 | | options: CacheOptions,206... |207477 | | ))208478 | | }209 | |_____^ not a member of trait `Middleware`210211error[E0407]: method `method` is not a member of trait `Middleware`212 --> /build/cargo-vendor-dir/http-cache-reqwest-1.0.0-alpha.8/src/lib.rs:516:5213 |214516 | / fn method(&self) -> Result<String> {215517 | | Ok(self.req.method().as_ref().to_string())216518 | | }217 | |_____^ not a member of trait `Middleware`218219For more information about this error, try `rustc --explain E0407`.220error: could not compile `http-cache-reqwest` (lib) due to 3 previous errors221warning: build failed, waiting for other jobs to finish...